{"text_format":"1","workbook":"xlsx","n_sheets":11,"sheets":["Cover Page - Required","Instructions","OSI Tips-Schools","Schools- OSI","Stat Adj","SDX Owned-Managed Inv","Client Owned Inventory","Late Payable","Transfers","Accruals & Deferrals","Functional Area Reclass"],"not_rendered":{"charts":0,"images":0,"macros":1,"external_links":0,"defined_names":8,"comments":0,"pivot_tables":0},"unopened":[],"bounds":{"document_bytes":16777216,"sheet_cells":100000,"rows_first":2000,"rows_last":500,"rows_between":2000,"halvings":0,"cell_chars":16384,"cell_head_chars":4096},"cells_cut":0,"cells_raw":0,"read":"whole","date_system":"1900"}

{"sheet":"Cover Page - Required","index":0,"n_rows":31,"n_cols":7,"rows_kept":31,"cut":false,"hidden":false,"merged":[[1,4,1,7]]}
[null,"Standard Close Adjustment Form"]
[null,"Cost Center #",null,null,"ONLY ENTER IN THE ORANGE SHADED CELLS"]
[null,"Cost Center Name",null,null,"Revised: 5/22/2023"]
[null,"Month Ending Date",null,null,"Please make sure this form only contains"]
[null,"Contact Phone #",null,null,"current changes. Failure to remove prior"]
[null,null,null,null,"entries will result in duplicate adjustments"]
[null,"\nThe materiality threshold of $2,500 per event will be applied to adjustment requests.  \n\nThe AF topic (Journal Entry Guidelines) 275-01 includes information on  the materiality threshold.\n"]
[null,null,"Preparer",null,"Date Prepared",null,"Explanation Provided?"]
[null,"Schools - OSI Adjustment",null,null,null,null,{"$f":"_xlfn.IFS(AND(SUM('Schools- OSI'!$F$14:$F$109)<>0,'Schools- OSI'!$B$7<>\"\"),\"Yes\",AND(SUM('Schools- OSI'!$F$14:$F$109)<>0,'Schools- OSI'!$B$7=\"\"),\"No\",AND(SUM('Schools- OSI'!$F$14:$F$109)=0,'Schools- OSI'!$B$7=\"\"),\"\")","v":""}]
[]
[null,"STAT Adjustment",null,null,null,null,{"$f":"_xlfn.IFS(AND(SUM('Stat Adj'!$F$14:$F$101)<>0,'Stat Adj'!$B$7<>\"\"),\"Yes\",AND(SUM('Stat Adj'!$F$14:$F$101)<>0,'Stat Adj'!$B$7=\"\"),\"No\",AND(SUM('Stat Adj'!$F$14:$F$101)=0,'Stat Adj'!$B$7=\"\"),\"\")","v":""}]
[]
["","SDX Owned/Managed\nInventory",null,null,null,null,{"$f":"_xlfn.IFS(AND(SUM('SDX Owned-Managed Inv'!$E$28,'SDX Owned-Managed Inv'!$E$40,'SDX Owned-Managed Inv'!$E$31,'SDX Owned-Managed Inv'!$E$54,'SDX Owned-Managed Inv'!$E$62,'SDX Owned-Managed Inv'!$E$69,'SDX Owned-Managed Inv'!$E$96,'SDX Owned-Managed Inv'!$E$103,'SDX Owned-Managed Inv'!$E$126,'SDX Owned-Managed Inv'!$E$128:$E$141)<>0,OR('SDX Owned-Managed Inv'!$A$7<>\"\",'SDX Owned-Managed Inv'!$A$8<>\"\")),\"Yes\",AND(SUM('SDX Owned-Managed Inv'!$E$28,'SDX Owned-Managed Inv'!$E$40,'SDX Owned-Managed Inv'!$E$31,'SDX Owned-Managed Inv'!$E$54,'SDX Owned-Managed Inv'!$E$62,'SDX Owned-Managed Inv'!$E$69,'SDX Owned-Managed Inv'!$E$96,'SDX Owned-Managed Inv'!$E$103,'SDX Owned-Managed Inv'!$E$126,'SDX Owned-Managed Inv'!$E$128:$E$141)<>0,OR('SDX Owned-Managed Inv'!$A$7=\"\",'SDX Owned-Managed Inv'!$A$8=\"\")),\"No\",AND(SUM('SDX Owned-Managed Inv'!$E$28,'SDX Owned-Managed Inv'!$E$40,'SDX Owned-Managed Inv'!$E$31,'SDX Owned-Managed Inv'!$E$54,'SDX Owned-Managed Inv'!$E$62,'SDX Owned-Managed Inv'!$E$69,'SDX Owned-Managed Inv'!$E$96,'SDX Owned-Managed Inv'!$E$103,'SDX Owned-Managed Inv'!$E$126,'SDX Owned-Managed Inv'!$E$128:$E$141)=0,OR('SDX Owned-Managed Inv'!$A$7=\"\",'SDX Owned-Managed Inv'!$A$8=\"\")),\"\")","v":""}]
[]
[null,"Client Owned Inventory",null,null,null,null,{"$f":"_xlfn.IFS(AND(SUM('Client Owned Inventory'!F37,'Client Owned Inventory'!F43,'Client Owned Inventory'!F48,'Client Owned Inventory'!F78,'Client Owned Inventory'!F102,'Client Owned Inventory'!F112)=0,'Client Owned Inventory'!B6=\"\"),\"\",AND(SUM('Client Owned Inventory'!F37,'Client Owned Inventory'!F43,'Client Owned Inventory'!F48,'Client Owned Inventory'!F78,'Client Owned Inventory'!F102,'Client Owned Inventory'!F112)<>0,'Client Owned Inventory'!B6<>\"\"),\"Yes\",AND(SUM('Client Owned Inventory'!F37,'Client Owned Inventory'!F43,'Client Owned Inventory'!F48,'Client Owned Inventory'!F78,'Client Owned Inventory'!F102,'Client Owned Inventory'!F112)<>0,'Client Owned Inventory'!B6=\"\"),\"No\")","v":""}]
[]
["","Late Payables",null,null,null,null,{"$f":"IFERROR(_xlfn.IFS(AND(SUM('Late Payable'!$D$62)<>0,'Late Payable'!$A$10<>\"\"),\"Yes\",AND(SUM('Late Payable'!$D$62)<>0,'Late Payable'!$A$10=\"\"),\"No\",AND(SUM('Late Payable'!$D$62)=0,'Late Payable'!$A$10=\"\"),\"\"),\"\")","v":""}]
[]
[null,"Transfers",null,null,null,null,{"$f":"_xlfn.IFS(Transfers!$F$178=\"Yes\",\"Yes\",Transfers!$F$178=\"Explanation Needed\",\"No\",Transfers!$F$178=\"\",\"\")","v":""}]
[]
{"$rows_left_out":12}
{"sheet":"Instructions","index":1,"n_rows":43,"n_cols":2,"rows_kept":43,"cut":false,"hidden":false,"merged":[]}
["Standard Close Adjustment Form"]
["The materiality threshold of $2,500 per event will be applied to adjustment requests. "]
["The AF topic (Journal Entry Guidelines) 275-01 includes information on  the materiality threshold."]
["\"Subject\" line of email should include 1 unit number and the month or period the adjustments apply to."]
[]
["Please provide a brief explanation of why the entry is needed on each tab you are submitting. Forms without explanations"]
["will be returned for revision."]
[]
["The Cover Page is a REQUIRED form. Please complete the Unit #, Unit Name, Period/Month End date & Contact Phone #."]
["Include prepare name and date for each line that has a check in column A"]
[]
["1)  SCHOOLS - OSI Adj - for changes to Sales & Statistics reported via the OSI (the 9999.___ #'s)"]
["     (if you reports sales via a Unit Cash Report, this is NOT for you)"]
[null,"Also of note to OSI changes:"]
[]
[null," - Meal Equivalents, Total Meals, Total Meals for Fees, Breakfast or Snacks for Fees"]
[null,"are Buffalo calculated values and are not adjusted via this form. If you find errors in these accounts"]
[null,"it indicates there are also errors in your meal counts, sales accounts, and/or rates. Contact "]
[null,"your operations accountant for specific details for your unit(s)."]
[]
{"$rows_left_out":24}
{"sheet":"OSI Tips-Schools","index":2,"n_rows":57,"n_cols":4,"rows_kept":57,"cut":false,"hidden":false,"merged":[]}
[]
[null,"If you adjust one account in the section, you may need to adjust the other accounts as well as these accounts will not "]
[null,"automatically recalculate based on adjustments.  Please review the other associated accounts and include any changes "]
[null,"needed.  (These encompass the standard reimbursable meal accounts and may not include all accounts your unit uses.)"]
[]
[null,"Breakfast","Account","Dollar or Quantity"]
[null,"Free Breakfast",99997438,"#"]
[null,"Reduced Breakfast",99997436,"#"]
[null,"Paid Breakfast",99997434,"#"]
[null,"Total Breakfast Served (Total in account should equal the sum of free/red/paid accounts)",99997439,"#"]
[null,"Client Reimbursable - Breakfast- Federal",99990120,"$"]
[null,"Client Reimbursable - Breakfast- State",99990130,"$"]
[null,"Client Cash Breakfast",99990015,"$"]
[]
[null,"Lunch","Account","Dollar or Quantity"]
[null,"Free Lunch",99997442,"#"]
[null,"Reduced Lunch",99997441,"#"]
[null,"Paid Lunch",99997440,"#"]
[null,"Type A Meals Served (Total in account should equal the sum of free/red/paid accounts)",99997443,"#"]
[null,"Client Reimbursable - Lunch- Federal",99990140,"$"]
{"$rows_left_out":38}
{"sheet":"Schools- OSI","index":3,"n_rows":109,"n_cols":8,"rows_kept":109,"cut":false,"hidden":false,"merged":[]}
[null,"Standard Close Adjustment Form"]
[null,{"$f":"'Cover Page - Required'!C2","v":0},null,"ONLY ENTER IN THE ORANGE SHADED CELLS"]
[null,{"$f":"'Cover Page - Required'!C3","v":0}]
[null,"Effective period 1/17, the materiality threshold of $2,500 per event will be applied to adjustment requests. "]
[null,"\n\nThe AF topic (Journal Entry Guidelines) 275-01 includes information on  the materiality threshold.\n"]
[null,"EXPLANATION:"]
[]
[null,"This sheet is for Schools units ONLY!",null,null,null,null,null,"Do NOT submit changes for the below calculated accounts:"]
[null,null,null,"Unit must enter",null,null,null,99997480]
[null,null,null,"amts on CRED",null,null,null,99997482]
[null,null,null,"or Op Stmt","Unit must enter",null,null,99992095]
[null,"ACCOUNT DESCRIPTION","ACCT #","PRELIM","AMOUNT","CHANGE",null,99992035]
[null,null,null,"AMOUNT","SHOULD BE","BY",null,99992030]
[null,"MAC/FIXED PRICE",99998565,null,null,{"$f":"E14-D14","v":0},{"$f":"ABS(F14)","v":0}]
[null,"OPERATING DAYS",99997300,null,null,{"$f":"E15-D15","v":0},{"$f":"ABS(F15)","v":0}]
[null,"POPULATION (99997145)",99997149,null,null,{"$f":"E16-D16","v":0},0]
[null,"HOURS WORKED",99996480,null,null,0,0]
[null,"CLIENT HOURS WORKED",99991150,null,null,0,0]
[null,"ENT-COMMODITIES RECEIVED",99992700,null,null,{"$f":"E19-D19","v":0},0]
[null,"ENT-COMMODITIES USED",99992720,null,null,0,0]
{"$rows_left_out":90}
{"sheet":"Stat Adj","index":4,"n_rows":65,"n_cols":7,"rows_kept":65,"cut":false,"hidden":false,"merged":[]}
[null,"Standard Close Adjustment Form"]
[null,{"$f":"'Cover Page - Required'!C2","v":0},"ONLY ENTER DATA IN THE ORANGE SHADED CELLS"]
[null,{"$f":"'Cover Page - Required'!C3","v":0}]
[null,"Effective period 1/17, the materiality threshold of $2,500 per event will be applied to adjustment requests."]
[null,"\nThe AF topic (Journal Entry Guidelines) 275-01 includes information on  the materiality threshold."]
[null,"EXPLANATION:"]
[]
[]
[null,"This sheet is for all divisions EXCEPT Schools."]
[]
[null,"PLEASE GO BY ACCOUNT # AS DESCRIPTION",null,"Unit must enter"]
[null,"MAY BE CUSTOMIZED TO YOUR SPECIFIC UNIT",null,"amts on CRED"]
[null,null,null,"or Op Stmt/FAR","Unit must enter"]
[null,"ACCOUNT DESCRIPTION","ACCT #","PRELIM","AMOUNT","CHANGE"]
[null,null,null,"AMOUNT","SHOULD BE","BY"]
[null,"CLIENT CASH-BREAKFAST ",99990015,null,null,{"$f":"E16-D16","v":0},{"$f":"ABS(F16)","v":0}]
[null,"CLIENT BOARD SALES",99990200,null,null,{"$f":"E17-D17","v":0},0]
[null,"CLIENT FOOD SALES",99990205,null,null,0,0]
[null,"CLIENT FOOD SALES-CAFETERIA",99990210,null,null,0,0]
[null,"CLIENT FOOD SALES-SNACK BAR",99990215,null,null,0,0]
{"$rows_left_out":46}
{"sheet":"SDX Owned-Managed Inv","index":5,"n_rows":141,"n_cols":5,"rows_kept":141,"cut":false,"hidden":false,"merged":[]}
["Standard Close Adjustment Form"]
[{"$f":"'Cover Page - Required'!$C$2","v":0},"ONLY ENTER DATA IN THE ORANGE SHADED CELLS"]
[{"$f":"'Cover Page - Required'!$C$3","v":0}]
["Effective period 1/17, the materiality threshold of $2,500 per event will be applied to adjustment requests.  "]
["\n\nThe AF topic (Journal Entry Guidelines) 275-01 includes information on  the materiality threshold."]
["EXPLANATION:"]
[]
[]
["Please enter only the value of the",null,"unit must enter amts on DFAV/CRED","Unit must enter actual ending inv"]
["inventory. Do NOT include negative",null,"PRELIM","ENDING "]
["signs or the \"change by\" amount",null,"ENDING ","INVENTORY","CHANGE"]
["will be incorrect.",null,"INVENTORY","AMOUNT","BY"]
["FOOD ","ACCT #","AMOUNT","SHOULD BE"]
["BAKED GOODS",60110010,null,null,{"$f":"C14-D14","v":0}]
["BEVERAGE",60110020,null,null,0]
["MILK & ICE CREAM",60110030,null,null,0]
["GROCERIES",60110040,null,null,0]
["FROZEN FOOD",60110050,null,null,0]
["MEAT & SEAFOOD",60110060,null,null,0]
["PRODUCE",60110070,null,null,0]
{"$rows_left_out":122}
{"sheet":"Client Owned Inventory","index":6,"n_rows":112,"n_cols":7,"rows_kept":112,"cut":false,"hidden":false,"merged":[]}
[null,"Standard Close Adjustment Form"]
[null,{"$f":"'Cover Page - Required'!$C$2","v":0},null,"ONLY ENTER IN THE ORANGE SHADED CELLS"]
[null,{"$f":"'Cover Page - Required'!$C$3","v":0}]
[]
[null,"EXPLANATION:"]
[]
[]
[]
[]
[null,"This tab should be used if you report inventory to the"]
[null,"accounts that appear below.  Do NOT use if you report "]
[null,"to accounts that begin with \"6xxx.xxxx\""]
[]
[]
[null,"Please enter the VARIANCE equal to your"]
[null,"beginning inventory less ending inventory "]
[null,"in the \"SHOULD BE\" area.  Do not enter ",null,"Unit must enter ","Unit must enter "]
[null,"ending inventory values in this form.",null,"amts on FAR/CRED","actual variance amt"]
[null,null,null,"Variance","Variance","Variance"]
[null,"Account Description","ACCT #","Amount","Should Be","Change By"]
{"$rows_left_out":93}
{"sheet":"Late Payable","index":7,"n_rows":64,"n_cols":27,"rows_kept":64,"cut":false,"hidden":false,"merged":[[4,2,4,3],[5,2,5,3]]}
["Standard Close Adjustment Form"]
["Late Payable Accrual Request Form",null,null,"ONLY ENTER IN THE ORANGE SHADED CELLS"]
["Effective period 1/17, the materiality threshold of $2,500 per event will be applied to adjustment requests.  \n\n"]
["The AF topic (Journal Entry Guidelines) 275-01 includes information on  the materiality threshold."]
["Unit Name      ",null,{"$f":"'Cover Page - Required'!C3","v":0},null,"Account Distribution"]
["Unit Number  ",null,{"$f":"'Cover Page - Required'!C2","v":0}]
[null,null,null,null,null,null,"Milk &",null,"Meat, Eggs",null,"Misc. ","Commodities","Commodity",null,"Labor","Cleaning ","Paper","Paper","Small","Office ",null,"Fuel",null,null,null,"Other  ","Account "]
[null,null,null,null,"Baked Goods","Beverage","Ice Cream","Groceries","& Cheese","Produce","Product","Processed","Del/Adm","Pharmaceuticals","Other Employ","Supplies","N/T","Taxable","Equipment","Supplies","Misc.","Charges","Delivery","Uniform","Taxes","Amount ONLY","Number"]
["Vendor Name","Invoice #","Invoice Date","Invoice Total",60110010,60110020,60110030,60110040,60110060,60110070,60112000,60112011,60112012,60112020,64103700,60220001,60260001,60260010,60665001,60649003,60647000,62867055,62867050,60246000,63101000,"List Acct in Column AA","for Other"]
[null,null,null,{"$f":"SUM(E10:Z10)","v":0}]
[null,null,null,{"$f":"SUM(E11:Z11)","v":0}]
[null,null,null,0]
[null,null,null,0]
[null,null,null,0]
[null,null,null,0]
[null,null,null,0]
[null,null,null,0]
[null,null,null,0]
[null,null,null,0]
[null,null,null,0]
{"$rows_left_out":45}
{"sheet":"Transfers","index":8,"n_rows":178,"n_cols":6,"rows_kept":178,"cut":false,"hidden":false,"merged":[]}
[null,"Standard Close Adjustment Form"]
[null,{"$f":"'Cover Page - Required'!$C$2","v":0},null,"ONLY ENTER IN THE ORANGE SHADED CELLS"]
[null,{"$f":"'Cover Page - Required'!$C$3","v":0}]
[null,"Effective period 1/17, the materiality threshold of $2,500 per event will be applied to adjustment requests.  "]
[null,"\n\nThe AF topic (Journal Entry Guidelines) 275-01 includes information on  the materiality threshold."]
[null,"Labor","GL #","%","Amount","For Borrowed Wage Transfers, Enter the Wage "]
[null,"Wages - Reg",64100120,null,null,"amount into the proper cell (E4 = Hourly Wages, "]
[null,"Brwd Wg Ben Trans",64501100,0.11899999999999999,{"$f":"ROUND($D$8*$E$7,2)","v":0},"E10 = Admin) and it will calculate the suggested "]
[null,"Brwd Wage Tax",64501600,9.9000000000000005E-2,{"$f":"ROUND($D$9*$E$7,2)","v":0},"Taxes & Benefit amount to transfer. Please Copy "]
[null,"Brwd Wage W/C",61620047,6.7000000000000004E-2,{"$f":"ROUND($D$10*$E$7,2)","v":0},"& Paste Values this into the section below and "]
[null,null,null,null,null,"fill out the required explanation on why this "]
[null,"Admin Labor",null,null,null,"needs to be made. "]
[null,"Admin Wages",64101120]
[null,"Brwd Wg Ben Trans",64501130,0.11899999999999999,{"$f":"ROUND($D$14*$E$13,2)","v":0}]
[null,"Brwd Wage Tax",64505000,9.9000000000000005E-2,{"$f":"ROUND($D$15*$E$13,2)","v":0}]
[null,"Brwd Wage W/C",61620045,6.7000000000000004E-2,{"$f":"ROUND($D$16*$E$13,2)","v":0}]
[]
[]
[null,null,null,null,null,"Positive Numbers (decrease sales or increase expenses); Negative Numbers (increase sales or decrease expenses)"]
[null,"Unit #","Account","Transfer Amount","DETAILS  of Transfer. (i.e. Product Cost / Controllable)          (i.e. For Labor: Whose labor and the timeframe)","Explanation Provided?"]
{"$rows_left_out":159}
{"sheet":"Accruals & Deferrals","index":9,"n_rows":76,"n_cols":8,"rows_kept":76,"cut":false,"hidden":false,"merged":[]}
[null,"Cost Center",{"$f":"'Cover Page - Required'!$C$2","v":0},null,"THIS FORM IS TO BE USED FOR ADJUSTMENTS THAT CANNOT BE COMPLETED ON OTHER TABS, SUCH AS THE FOLLOWING:  SALES FROM MISSING CASH REPORT/UFS INVOICE**, DEFERRAL OF EXPENSES FOR CE NOT PROCESSED."]
[]
[null,null,null,null,"Positive Numbers (decrease sales or increase expenses); Negative Numbers (increase sales or decrease expenses)"]
[null,"Unit #","Account","ACCRUALS/DEFERRALS AMT","Reason for Accrual or Deferral?","Invoice Number (for UFS Accruals)","Invoice Date","Explanation Provided?"]
[null,null,null,null,null,null,null,{"$f":"_xlfn.IFS(AND(D5<>0,E5=\"\"),\"Explanation Needed\",AND(D5<>0,E5<>\"\"),\"Yes\",AND(D5=\"\",E5=\"\"),\"\")","v":""}]
[null,null,null,null,null,null,null,{"$f":"_xlfn.IFS(AND(D6<>0,E6=\"\"),\"Explanation Needed\",AND(D6<>0,E6<>\"\"),\"Yes\",AND(D6=\"\",E6=\"\"),\"\")","v":""}]
[null,null,null,null,null,null,null,{"$f":"_xlfn.IFS(AND(D7<>0,E7=\"\"),\"Explanation Needed\",AND(D7<>0,E7<>\"\"),\"Yes\",AND(D7=\"\",E7=\"\"),\"\")","v":""}]
[null,null,null,null,null,null,null,{"$f":"_xlfn.IFS(AND(D8<>0,E8=\"\"),\"Explanation Needed\",AND(D8<>0,E8<>\"\"),\"Yes\",AND(D8=\"\",E8=\"\"),\"\")","v":""}]
[null,null,null,null,null,null,null,{"$f":"_xlfn.IFS(AND(D9<>0,E9=\"\"),\"Explanation Needed\",AND(D9<>0,E9<>\"\"),\"Yes\",AND(D9=\"\",E9=\"\"),\"\")","v":""}]
[null,null,null,null,null,null,null,{"$f":"_xlfn.IFS(AND(D10<>0,E10=\"\"),\"Explanation Needed\",AND(D10<>0,E10<>\"\"),\"Yes\",AND(D10=\"\",E10=\"\"),\"\")","v":""}]
[null,null,null,null,null,null,null,{"$f":"_xlfn.IFS(AND(D11<>0,E11=\"\"),\"Explanation Needed\",AND(D11<>0,E11<>\"\"),\"Yes\",AND(D11=\"\",E11=\"\"),\"\")","v":""}]
[null,null,null,null,null,null,null,{"$f":"_xlfn.IFS(AND(D12<>0,E12=\"\"),\"Explanation Needed\",AND(D12<>0,E12<>\"\"),\"Yes\",AND(D12=\"\",E12=\"\"),\"\")","v":""}]
[null,null,null,null,null,null,null,{"$f":"_xlfn.IFS(AND(D13<>0,E13=\"\"),\"Explanation Needed\",AND(D13<>0,E13<>\"\"),\"Yes\",AND(D13=\"\",E13=\"\"),\"\")","v":""}]
[null,null,null,null,null,null,null,{"$f":"_xlfn.IFS(AND(D14<>0,E14=\"\"),\"Explanation Needed\",AND(D14<>0,E14<>\"\"),\"Yes\",AND(D14=\"\",E14=\"\"),\"\")","v":""}]
[null,null,null,null,null,null,null,{"$f":"_xlfn.IFS(AND(D15<>0,E15=\"\"),\"Explanation Needed\",AND(D15<>0,E15<>\"\"),\"Yes\",AND(D15=\"\",E15=\"\"),\"\")","v":""}]
[null,null,null,null,null,null,null,{"$f":"_xlfn.IFS(AND(D16<>0,E16=\"\"),\"Explanation Needed\",AND(D16<>0,E16<>\"\"),\"Yes\",AND(D16=\"\",E16=\"\"),\"\")","v":""}]
[null,null,null,null,null,null,null,{"$f":"_xlfn.IFS(AND(D17<>0,E17=\"\"),\"Explanation Needed\",AND(D17<>0,E17<>\"\"),\"Yes\",AND(D17=\"\",E17=\"\"),\"\")","v":""}]
[null,null,null,null,null,null,null,{"$f":"_xlfn.IFS(AND(D18<>0,E18=\"\"),\"Explanation Needed\",AND(D18<>0,E18<>\"\"),\"Yes\",AND(D18=\"\",E18=\"\"),\"\")","v":""}]
[null,null,null,null,null,null,null,{"$f":"_xlfn.IFS(AND(D19<>0,E19=\"\"),\"Explanation Needed\",AND(D19<>0,E19<>\"\"),\"Yes\",AND(D19=\"\",E19=\"\"),\"\")","v":""}]
[null,null,null,null,null,null,null,{"$f":"_xlfn.IFS(AND(D20<>0,E20=\"\"),\"Explanation Needed\",AND(D20<>0,E20<>\"\"),\"Yes\",AND(D20=\"\",E20=\"\"),\"\")","v":""}]
{"$rows_left_out":57}
{"sheet":"Functional Area Reclass","index":10,"n_rows":200,"n_cols":6,"rows_kept":200,"cut":false,"hidden":false,"merged":[]}
["Cost Center Number:",null,{"$f":"'Cover Page - Required'!$C$2","v":0},null,"Description Column Mandatory"]
[]
[null,null,"Positive Numbers (decrease sales or increase expenses) "]
["Unit Number","GL Account","Negative Numbers (increase sales or decrease expenses)","Functional Area","REASON FOR RECLASS","Explanation Provided?"]
[99999999,60647000,1000,116,"Contractual, see contract section 7.3","Example"]
[99999999,60647000,-1000,111,"Contractual, see contract section 7.3","Example"]
[null,null,null,null,null,{"$f":"IFERROR(_xlfn.IFS(AND(C7<>0,E7=\"\"),\"Explanation Needed\",AND(C7<>0,E7<>\"\"),\"Yes\",AND(C7=\"\",E7=\"\"),\"\"),\"\")","v":""}]
[null,null,null,null,null,{"$f":"IFERROR(_xlfn.IFS(AND(C8<>0,E8=\"\"),\"Explanation Needed\",AND(C8<>0,E8<>\"\"),\"Yes\",AND(C8=\"\",E8=\"\"),\"\"),\"\")","v":""}]
[null,null,null,null,null,{"$f":"IFERROR(_xlfn.IFS(AND(C9<>0,E9=\"\"),\"Explanation Needed\",AND(C9<>0,E9<>\"\"),\"Yes\",AND(C9=\"\",E9=\"\"),\"\"),\"\")","v":""}]
[null,null,null,null,null,{"$f":"IFERROR(_xlfn.IFS(AND(C10<>0,E10=\"\"),\"Explanation Needed\",AND(C10<>0,E10<>\"\"),\"Yes\",AND(C10=\"\",E10=\"\"),\"\"),\"\")","v":""}]
[null,null,null,null,null,{"$f":"IFERROR(_xlfn.IFS(AND(C11<>0,E11=\"\"),\"Explanation Needed\",AND(C11<>0,E11<>\"\"),\"Yes\",AND(C11=\"\",E11=\"\"),\"\"),\"\")","v":""}]
[null,null,null,null,null,{"$f":"IFERROR(_xlfn.IFS(AND(C12<>0,E12=\"\"),\"Explanation Needed\",AND(C12<>0,E12<>\"\"),\"Yes\",AND(C12=\"\",E12=\"\"),\"\"),\"\")","v":""}]
[null,null,null,null,null,{"$f":"IFERROR(_xlfn.IFS(AND(C13<>0,E13=\"\"),\"Explanation Needed\",AND(C13<>0,E13<>\"\"),\"Yes\",AND(C13=\"\",E13=\"\"),\"\"),\"\")","v":""}]
[null,null,null,null,null,{"$f":"IFERROR(_xlfn.IFS(AND(C14<>0,E14=\"\"),\"Explanation Needed\",AND(C14<>0,E14<>\"\"),\"Yes\",AND(C14=\"\",E14=\"\"),\"\"),\"\")","v":""}]
[null,null,null,null,null,{"$f":"IFERROR(_xlfn.IFS(AND(C15<>0,E15=\"\"),\"Explanation Needed\",AND(C15<>0,E15<>\"\"),\"Yes\",AND(C15=\"\",E15=\"\"),\"\"),\"\")","v":""}]
[null,null,null,null,null,{"$f":"IFERROR(_xlfn.IFS(AND(C16<>0,E16=\"\"),\"Explanation Needed\",AND(C16<>0,E16<>\"\"),\"Yes\",AND(C16=\"\",E16=\"\"),\"\"),\"\")","v":""}]
[null,null,null,null,null,{"$f":"IFERROR(_xlfn.IFS(AND(C17<>0,E17=\"\"),\"Explanation Needed\",AND(C17<>0,E17<>\"\"),\"Yes\",AND(C17=\"\",E17=\"\"),\"\"),\"\")","v":""}]
[null,null,null,null,null,{"$f":"IFERROR(_xlfn.IFS(AND(C18<>0,E18=\"\"),\"Explanation Needed\",AND(C18<>0,E18<>\"\"),\"Yes\",AND(C18=\"\",E18=\"\"),\"\"),\"\")","v":""}]
[null,null,null,null,null,{"$f":"IFERROR(_xlfn.IFS(AND(C19<>0,E19=\"\"),\"Explanation Needed\",AND(C19<>0,E19<>\"\"),\"Yes\",AND(C19=\"\",E19=\"\"),\"\"),\"\")","v":""}]
[null,null,null,null,null,{"$f":"IFERROR(_xlfn.IFS(AND(C20<>0,E20=\"\"),\"Explanation Needed\",AND(C20<>0,E20<>\"\"),\"Yes\",AND(C20=\"\",E20=\"\"),\"\"),\"\")","v":""}]
{"$rows_left_out":180}