{"text_format":"1","workbook":"xlsx","n_sheets":15,"sheets":["wksInfo","Essbase_stat","Essbase_P&L","Data_Input","Client Budget Input","Client Data Sheet","CPI - Index","PPI -  Food","PPI - Paper","PPI - Other controllable","Hrly Labor Comp. Index","Sodexo Comp Guidelines","Index Chart Data","Sheet1","Sheet2"],"not_rendered":{"charts":6,"images":1,"macros":1,"external_links":5,"defined_names":138,"comments":3,"pivot_tables":0},"unopened":[],"bounds":{"document_bytes":16777216,"sheet_cells":100000,"rows_first":2000,"rows_last":500,"rows_between":2000,"halvings":0,"cell_chars":16384,"cell_head_chars":4096},"cells_cut":0,"cells_raw":0,"read":"whole","date_system":"1900"}

{"sheet":"wksInfo","index":0,"n_rows":32,"n_cols":9,"rows_kept":32,"cut":false,"hidden":false,"merged":[[5,6,5,9],[6,6,6,9]]}
[]
[null,null,null,null,null,"Current Fiscal Year"]
[null,null,null,"Actuals thru Period ->","APR","FY 2022 Actual",{"$f":"+IF(Data_Input!G12=\" \",\"  *** Index Error ***\",IF(Data_Input!G19=\" \",\"  *** Index Error ***\",IF(Data_Input!G31=\" \",\"  *** Index Error ***\",\"\")))","v":""}]
[null,null,null,null,{"$f":"VLOOKUP(E$3,C20:F31,3,FALSE)","v":"Pd 08 YTD"}]
[null,null,null,null,{"$f":"VLOOKUP($E$3,$C$20:$F$31,4,FALSE)","v":8}]
[null,null,null,null,null,null,{"$f":"IF('Essbase_P&L'!H35=SUM('Essbase_P&L'!H4:H32),\"Revenue OK\",\"Revenue does not match - INVESTIGATE VARIANCE of $\"&\"('Essbase_P&L'!H35-SUM('Essbase_P&L'!H4:H32))\")","v":"Revenue OK"}]
[null,"Essbase Unit Name :->","ENCOMPASS REHAB HOSP OF SEWICK : 77061-000 : 70-00857",null,null,null,{"$f":"IF('Essbase_P&L'!O76='Essbase_P&L'!O75,\"Operating Costs OK\",\"Operating Processing Costs do not match. INVESTIGATE VARIANCE of $\"&\"'Essbase_P&L'!O77\")","v":"Operating Costs OK"}]
[]
[]
[null,null,null,null,"CPI","ECI Labor"]
{"$rows_left_out":23}
{"sheet":"Essbase_stat","index":1,"n_rows":18,"n_cols":25,"rows_kept":18,"cut":false,"hidden":false,"merged":[]}
[]
[null,"Document Type","Document Type","Document Type","Document Type","Document Type","Document Type","Document Type","Document Type","Document Type","Document Type","Document Type","Document Type","Document Type","Document Type","Document Type","Document Type","Document Type","Document Type","Document Type","Document Type","Document Type","Document Type","Document Type","Document Type"]
[null,"Quantity","Quantity","Quantity","Quantity","Quantity","Quantity","Quantity","Quantity","Quantity","Quantity","Quantity","Quantity","Quantity","Quantity","Quantity","Quantity","Quantity","Quantity","Quantity","Quantity","Quantity","Quantity","Quantity","Quantity"]
[null,"MANHOURS-REGULAR HOURS WORKED-HOURLY : 9999.6325","#MAN HOURS-OVERTIME-HOURLY-FULL TIME : 9999.9300","#MAN HOURS-SICK-HOURLY-FULL TIME : 9999.9400","#MAN HOURS-HOLIDAY-HOURLY-FULL TIME : 9999.9520","#MAN HOURS-PERSONAL-HOURLY-FULL TIME : 9999.9561","#MAN HOURS-JURY DUTY-HOURLY-FULL TIME : 9999.9569","MAN HOURS-BEREAVEMENT/FUNERAL LEAVE-HOURLY-FT : 9999.9578","MAN HOURS-VACATION TAKEN-HOURLY-FULL TIME : 9999.9900","MANHOURS-REGULAR HOURS WORKED-HOURLY : 9999.6325","#MAN HOURS-OVERTIME-HOURLY-FULL TIME : 9999.9300","#MAN HOURS-SICK-HOURLY-FULL TIME : 9999.9400","#MAN HOURS-HOLIDAY-HOURLY-FULL TIME : 9999.9520","#MAN HOURS-PERSONAL-HOURLY-FULL TIME : 9999.9561","#MAN HOURS-JURY DUTY-HOURLY-FULL TIME : 9999.9569","MAN HOURS-BEREAVEMENT/FUNERAL LEAVE-HOURLY-FT : 9999.9578","MAN HOURS-VACATION TAKEN-HOURLY-FULL TIME : 9999.9900","MANHOURS-REGULAR HOURS WORKED-HOURLY : 9999.6325","#MAN HOURS-OVERTIME-HOURLY-FULL TIME : 9999.9300","#MAN HOURS-SICK-HOURLY-FULL TIME : 9999.9400","#MAN HOURS-HOLIDAY-HOURLY-FULL TIME : 9999.9520","#MAN HOURS-PERSONAL-HOURLY-FULL TIME : 9999.9561","#MAN HOURS-JURY DUTY-HOURLY-FULL TIME : 9999.9569","MAN HOURS-BEREAVEMENT/FUNERAL LEAVE-HOURLY-FT : 9999.9578","MAN HOURS-VACATION TAKEN-HOURLY-FULL TIME : 9999.9900"]
[null,{"$f":"wksInfo!E4","v":"Pd 08 YTD"},{"$f":"+B5","v":"Pd 08 YTD"},"Pd 08 YTD","Pd 08 YTD","Pd 08 YTD","Pd 08 YTD","Pd 08 YTD","Pd 08 YTD","Pd 12 YTD","Pd 12 YTD","Pd 12 YTD","Pd 12 YTD","Pd 12 YTD","Pd 12 YTD","Pd 12 YTD","Pd 12 YTD",{"$f":"+B5","v":"Pd 08 YTD"},{"$f":"+R5","v":"Pd 08 YTD"},"Pd 08 YTD","Pd 08 YTD","Pd 08 YTD","Pd 08 YTD","Pd 08 YTD","Pd 08 YTD"]
[null,{"$f":"\"FY \"&wksInfo!C17&\" Actual\"","v":"FY 2021 Actual"},"FY 2021 Actual","FY 2021 Actual","FY 2021 Actual","FY 2021 Actual","FY 2021 Actual","FY 2021 Actual","FY 2021 Actual",{"$f":"+I6","v":"FY 2021 Actual"},"FY 2021 Actual","FY 2021 Actual","FY 2021 Actual","FY 2021 Actual","FY 2021 Actual","FY 2021 Actual","FY 2021 Actual",{"$f":"\"FY \"&wksInfo!C18&\" Actual\"","v":"FY 2022 Actual"},"FY 2022 Actual","FY 2022 Actual","FY 2022 Actual","FY 2022 Actual","FY 2022 Actual","FY 2022 Actual","FY 2022 Actual"]
[{"$f":"wksInfo!C7","v":"ENCOMPASS REHAB HOSP OF SEWICK : 77061-000 : 70-00857"},0,0,0,0,0,0,0,0,0,0,0,0,0,0,0,0,0,0,0,0,0,0,0,0]
[]
[]
[]
{"$rows_left_out":9}
{"sheet":"Essbase_P&L","index":2,"n_rows":77,"n_cols":21,"rows_kept":77,"cut":false,"hidden":false,"merged":[]}
[null,null,null,null,null,{"$f":"+Essbase_stat!A7","v":"ENCOMPASS REHAB HOSP OF SEWICK : 77061-000 : 70-00857"},"Admin Total","Currency","Document Type"]
[null,null,null,null,{"$f":"+G2","v":"Pd 08 YTD"},"Pd 12 YTD",{"$f":"+Essbase_stat!B5","v":"Pd 08 YTD"},"Pd 12 YTD",{"$f":"+G2","v":"Pd 08 YTD"},null,null,"Prior",null,null,"Current "]
[null,null,null,null,{"$f":"+Essbase_stat!B17","v":"FY 2020 Actual"},{"$f":"+Essbase_stat!J17","v":"FY 2020 Actual"},{"$f":"+Essbase_stat!B6","v":"FY 2021 Actual"},{"$f":"+G3","v":"FY 2021 Actual"},{"$f":"+Essbase_stat!R6","v":"FY 2022 Actual"},null,null,"12 MONTHS",null,null,"12 MONTHS","OLD CATEGORY ROLL UP","DATA INPUT CATEGORY","Exclude from \"All Other Operating Expenses\"","Exclude from \"All Other Operating Expenses\" and Inflation","Include in \"Inflation\" for \"All Other Operating Expenses\""]
[null,{"$f":"D4","v":"CAFÉ REVENUE : CAF0000_7110"},{"$f":"MID(D4,FIND(\":\",D4)+1,256)","v":" CAF0000_7110"},"CAFÉ REVENUE : CAF0000_7110",3844.5,8082.25,15831.75,23457.5,18051,null,null,{"$f":"SUM(F4)-SUM(E4)+SUM(G4)","v":20069.5},null,null,{"$f":"SUM(H4)-SUM(G4)+SUM(I4)","v":25676.75},"BOARD","Retail Sales"]
[null,{"$f":"D5","v":"VENDING REVENUE : VEN0000_7110"},{"$f":"MID(D5,FIND(\":\",D5)+1,256)","v":" VEN0000_7110"},"VENDING REVENUE : VEN0000_7110",447.68,447.68,0,0,0,null,null,{"$f":"SUM(F5)-SUM(E5)+SUM(G5)","v":0},null,null,{"$f":"SUM(H5)-SUM(G5)+SUM(I5)","v":0},"RETAIL","Retail Sales"]
[null,"CONVENIENCE STORES REVENUE : CNV0000_7110"," CNV0000_7110","CONVENIENCE STORES REVENUE : CNV0000_7110",0,0,0,0,0,null,null,{"$f":"SUM(F6)-SUM(E6)+SUM(G6)","v":0},null,null,{"$f":"SUM(H6)-SUM(G6)+SUM(I6)","v":0},null,"Retail Sales"]
[null,"BOARD REVENUE : BRD0000_7110"," BRD0000_7110","BOARD REVENUE : BRD0000_7110",0,0,0,0,0,null,null,{"$f":"SUM(F7)-SUM(E7)+SUM(G7)","v":0},null,null,{"$f":"SUM(H7)-SUM(G7)+SUM(I7)","v":0},"RETAIL","Retail Sales"]
[null,"REV-MEALS ON WHEELS : 7110 : 7001.1300"," 7110 : 7001.1300","REV-MEALS ON WHEELS : 7110 : 7001.1300",0,0,0,0,0,null,null,0,null,null,0,"CATERING","Resident Revenue"]
[null,"REV-LIQUOR : 7110 : 7001.6170"," 7110 : 7001.6170","REV-LIQUOR : 7110 : 7001.6170",0,0,0,0,0,null,null,0,null,null,0,"CATERING","Catering Sales"]
[null,"REV-FOOD SPCL FUNC : 7110 : 7004.1000"," 7110 : 7004.1000","REV-FOOD SPCL FUNC : 7110 : 7004.1000",0,0,0,0,0,null,null,0,null,null,0,"CATERING","Catering Sales"]
{"$rows_left_out":68}
{"sheet":"Data_Input","index":3,"n_rows":47,"n_cols":18,"rows_kept":47,"cut":false,"hidden":false,"merged":[[38,1,38,14],[0,1,0,14]]}
[null,"PAGE NOT INTENDED FOR CLIENT PRESENTATION-USE CLIENT DATA SHEET",null,null,null,null,null,null,null,null,null,null,null,null,null,null,"Rate Ren Fy14 v1.2"]
[null,{"$f":"+'Essbase_P&L'!F1","v":"ENCOMPASS REHAB HOSP OF SEWICK : 77061-000 : 70-00857"}]
[null,null,"12 Month Period",null,"Categories Subject to Inflation",null,"Inflation Index",null,"Adj.",null,"Ann'l avg Inflation Index",null,"$ Inflation",null,"Notes"]
[null,"Resident Revenue",{"$f":"SUMIF(DATA_CATEGORIES,\"=\"&B4,Essbase_DATA)","v":397825.08999999997},null,{"$f":"C4+I4","v":397825.08999999997},null,null,null,null,null,null,null,{"$f":"E4*K4","v":0},null,"N/A"]
[null,"Client Reimbursement Sales",{"$f":"SUMIF(DATA_CATEGORIES,\"=\"&B5,Essbase_DATA)","v":-11184.530000000008},null,{"$f":"C5","v":-11184.530000000008},null,null,null,null,null,null,null,{"$f":"E5*K5","v":0},null,"N/A"]
[null,"Retail Sales",{"$f":"SUMIF(DATA_CATEGORIES,\"=\"&B6,Essbase_DATA)","v":25676.75},null,{"$f":"C6","v":25676.75},null,null,null,null,null,null,null,{"$f":"E6*K6","v":0},null,"N/A"]
[null,"Catering Sales",{"$f":"SUMIF(DATA_CATEGORIES,\"=\"&B7,Essbase_DATA)","v":0},null,{"$f":"+C7","v":0},null,null,null,null,null,null,null,{"$f":"E7*K7","v":0},null,"N/A"]
[null,"Annual Revenue/Rate increase",{"$f":"SUM(C4:C7)","v":412317.30999999994},null,{"$f":"SUM(E4:E7)","v":412317.30999999994},null,null,null,null,null,null,null,{"$f":"SUM(M4:M7)","v":0}]
[]
[]
{"$rows_left_out":38}
{"sheet":"Client Budget Input","index":4,"n_rows":41,"n_cols":18,"rows_kept":41,"cut":false,"hidden":true,"merged":[[0,1,0,14],[39,1,39,14]]}
[null,"PAGE NOT INTENDED FOR CLIENT PRESENTATION-USE CLIENT DATA SHEET",null,null,null,null,null,null,null,null,null,null,null,null,null,null,"Rate Ren Fy14 v1.2"]
[null,{"$f":"+'Essbase_P&L'!F1","v":"ENCOMPASS REHAB HOSP OF SEWICK : 77061-000 : 70-00857"}]
[null,null,"12 Month Period",null,"Categories Subject to Inflation",null,"Inflation Index",null,"Adj.",null,"Ann'l avg Inflation Index",null,"$ Inflation",null,"Notes"]
[null,"Retail Sales",null,null,{"$f":"C4","v":0},null,null,null,null,null,null,null,{"$f":"E4*K4","v":0},null,"N/A"]
[null,"Catering Sales",null,null,{"$f":"+C5","v":0},null,null,null,null,null,null,null,{"$f":"E5*K5","v":0},null,"N/A"]
[null,"Annual Revenue/Rate increase",null,null,{"$f":"SUM(E2:E5)","v":0},null,null,null,null,null,null,null,{"$f":"SUM(M2:M5)","v":0}]
[]
[]
[]
[null,"Food Cost",null,null,{"$f":"C10","v":0},null,{"$f":"IF(wksInfo!E10=\"PPI\",VLOOKUP(wksInfo!E12,'PPI -  Food'!$A$25:$BO$36,'PPI -  Food'!$BO$22,FALSE),VLOOKUP(wksInfo!E12,'CPI - Index'!$A$78:$BP$90,'CPI - Index'!$BP$76,FALSE))","v":5.0050488316687888E-2},null,null,null,{"$f":"SUM(G10:J10)","v":5.0050488316687888E-2},{"$f":"IF(G10<>K10,\"*\",\"\")","v":""},{"$f":"E10*K10","v":0},null,{"$f":"IF(wksInfo!E10=\"PPI\",\"Producer Price Index for Finished Consumer Foods (WPUFD4111)\",\"Consumer Price Index FAH (CUUR0000SAF11)\")","v":"Consumer Price Index FAH (CUUR0000SAF11)"}]
{"$rows_left_out":32}
{"sheet":"Client Data Sheet","index":5,"n_rows":45,"n_cols":14,"rows_kept":45,"cut":false,"hidden":false,"merged":[[0,1,0,10]]}
[null,{"$f":"Data_Input!B2","v":"ENCOMPASS REHAB HOSP OF SEWICK : 77061-000 : 70-00857"},null,null,null,null,null,null,null,null,null,null,"Convert back","Regular"]
[null,null,null,null,"Cost Categories Subject to Inflation",null,"Ann'l avg Inflation Index",null,"$ Inflation",null,"Notes",null,"Y","Y"]
[null,"Board Sales",null,null,{"$f":"Data_Input!E4","v":397825.08999999997},null,{"$f":"+Data_Input!K4","v":0},null,{"$f":"E3*G3","v":0},null,{"$f":"+Data_Input!O4","v":"N/A"},null,"N","Y"]
[null,"Settlement Sales",null,null,{"$f":"Data_Input!E5","v":-11184.530000000008},null,{"$f":"+Data_Input!K5","v":0},null,{"$f":"E4*G4","v":0},null,{"$f":"+Data_Input!O5","v":"N/A"},null,"N","Y"]
[null,"Retail Sales",null,null,{"$f":"Data_Input!E6","v":25676.75},null,{"$f":"+Data_Input!K6","v":0},null,{"$f":"E5*G5","v":0},null,{"$f":"+Data_Input!O6","v":"N/A"},null,"N","Y"]
[null,"Catering Sales",null,null,{"$f":"Data_Input!E7","v":0},null,{"$f":"+Data_Input!K7","v":0},null,{"$f":"E6*G6","v":0},null,{"$f":"+Data_Input!O7","v":"N/A"},null,"N","Y"]
[null,"Camp/Conference Sales",null,null,{"$f":"Data_Input!#REF!","v":{"$error":"#REF!"}},null,{"$f":"+Data_Input!#REF!","v":{"$error":"#REF!"}},null,{"$f":"E7*G7","v":{"$error":"#REF!"}},null,{"$f":"+Data_Input!#REF!","v":{"$error":"#REF!"}},null,"N","Y"]
[null,"Annual Revenue/Rate increase",null,null,{"$f":"SUM(E3:E7)","v":{"$error":"#REF!"}},null,null,null,{"$f":"SUM(I3:I7)","v":{"$error":"#REF!"}},null,null,null,"N","Y"]
[null,null,null,null,null,null,null,null,null,null,null,null,"N","Y"]
[null,"Food Cost",null,null,{"$f":"Data_Input!E11","v":242749.78000000003},null,{"$f":"Data_Input!K11","v":5.0050488316687888E-2},null,{"$f":"E10*G10","v":12149.745027768557},null,{"$f":"+Data_Input!O11&\" \" &Data_Input!L11","v":"Consumer Price Index FAH (CUUR0000SAF11) "},null,"Y","Y"]
{"$rows_left_out":36}
{"sheet":"CPI - Index","index":6,"n_rows":90,"n_cols":90,"rows_kept":90,"cut":false,"hidden":true,"merged":[[68,1,70,62],[46,58,46,66],[76,58,76,66],[46,77,46,84],[76,77,76,84],[72,80,74,84],[42,80,44,84],[6,1,10,62],[38,1,40,62],[16,58,16,66],[16,77,16,84],[12,80,14,84]]}
[]
[null,null,null,null,null,null,null,null,null,null,null,null,null,null,null,null,null,null,null,null,null,null,null,null,null,null,null,null,null,null,null,null,null,null,null,null,null,null,null,null,null,null,null,null,null,null,null,null,null,null,null,null,null,null,null,null,null,null,null,null,null,null,"Series Id:","CUUR0000SA0",null,null,null,null,null,null,null,null,null,null,null,null,null,null,null,null,null,null,null,null,null,null,null,null,"Series Id:","CUUR0000SA0"]
[null,null,null,null,null,null,null,null,null,null,null,null,null,null,null,null,null,null,null,null,null,null,null,null,null,null,null,null,null,null,null,null,null,null,null,null,null,null,null,null,null,null,null,null,null,null,null,null,null,null,null,null,null,null,null,null,null,null,null,null,null,null,"Not Seasonally Adjusted",null,null,null,null,null,null,null,null,null,null,null,null,null,null,null,null,null,null,null,null,null,null,null,null,null,"Not Seasonally Adjusted"]
[null,null,null,null,null,null,null,null,null,null,null,null,null,null,null,null,null,null,null,null,null,null,null,null,null,null,null,null,null,null,null,null,null,null,null,null,null,null,null,null,null,null,null,null,null,null,null,null,null,null,null,null,null,null,null,null,null,null,null,null,null,null,"Area:","U.S. city average",null,null,null,null,null,null,null,null,null,null,null,null,null,null,null,null,null,null,null,null,null,null,null,null,"Area:","U.S. city average"]
[null,null,null,null,null,null,null,null,null,null,null,null,null,null,null,null,null,null,null,null,null,null,null,null,null,null,null,null,null,null,null,null,null,null,null,null,null,null,null,null,null,null,null,null,null,null,null,null,null,null,null,null,null,null,null,null,null,null,null,null,null,null,"Item:","All items",null,null,null,null,null,null,null,null,null,null,null,null,null,null,null,null,null,null,null,null,null,null,null,null,"Item:","All items"]
[]
[null,"The Consumer Price Index for all urban consumers is a measure of the average change in prices, over time, in a fixed market basket of goods and services.  The CPI-U encompasses approximately 80% of the population, and includes food clothing, shelter, fuels, transportation fares, doctor and dentist services, drugs, and the other goods and services people buy for day to day living.  Eighty-five urban areas which include about 57,000 housing units and approximately 19,000 retail establishments are surveyed on a monthly basis.  All taxes directly associated with the purchase and use of these items are included.  Food, fuel, and a few other items are surveyed every other month.  "]
[null,null,null,null,null,null,null,null,null,null,null,null,null,null,null,null,null,null,null,null,null,null,null,null,null,null,null,null,null,null,null,null,null,null,null,null,null,null,null,null,null,null,null,null,null,null,null,null,null,null,null,null,null,null,null,null,null,null,null,null,null,null,null,null,null,null,null,null,null,null,null,null,null,null,null,null,null,null,null,null,null,null,null,null,null,null,null,null,"CONSUMER'S PRICE INDEX"]
[null,null,null,null,null,null,null,null,null,null,null,null,null,null,null,null,null,null,null,null,null,null,null,null,null,null,null,null,null,null,null,null,null,null,null,null,null,null,null,null,null,null,null,null,null,null,null,null,null,null,null,null,null,null,null,null,null,null,null,null,null,null,null,null,null,null,null,null,null,null,null,null,null,null,null,null,null,null,null,null,null,null,null,null,null,null,null,null,"ALL ITEMS, ALL URBAN CONSUMERS, US CITY AVERAGE (CPI-U)*"]
[]
{"$rows_left_out":81}
{"sheet":"PPI -  Food","index":7,"n_rows":36,"n_cols":85,"rows_kept":36,"cut":false,"hidden":true,"merged":[[11,1,15,62],[22,58,22,66],[22,71,22,83],[18,79,20,83]]}
[null,"PRODUCER'S PRICE INDEX"]
[]
[null,"The Producer Price Index measures the average changes in prices received by domestic producers of commodities"]
[null,"at all stages of processing.  Imports are not included.  Other sectors included are agriculture, fishing, forestry,"]
[null,"services, gas and electricity.  Finished goods are commodities ready for sale."]
[]
[]
[]
[null,null,null,null,null,null,null,null,null,null,null,null,null,null,null,null,null,null,null,null,null,null,null,null,null,null,null,null,null,null,null,null,null,null,null,null,null,null,null,null,null,null,null,null,null,null,null,null,null,null,null,null,null,null,null,null,null,null,null,null,"Group:","Stage of processing"]
[null,null,null,null,null,null,null,null,null,null,null,null,null,null,null,null,null,null,null,null,null,null,null,null,null,null,null,null,null,null,null,null,null,null,null,null,null,null,null,null,null,null,null,null,null,null,null,null,null,null,null,null,null,null,null,null,null,null,null,null,"Item:","Finished consumer foods"]
{"$rows_left_out":27}
{"sheet":"PPI - Paper","index":8,"n_rows":31,"n_cols":48,"rows_kept":31,"cut":false,"hidden":true,"merged":[[17,19,17,32],[17,34,17,46],[14,41,14,46]]}
[]
[null,null,null,null,null,null,null,null,null,null,null,null,null,null,null,null,null,null,null,null,null,null,null,null,null,null,null,null,"Series Id:","WPU091503"]
[null,null,null,null,null,null,null,null,null,null,null,null,null,null,null,null,null,null,null,null,null,null,null,null,null,null,null,null,"Not Seasonally Adjusted"]
[null,null,null,null,null,null,null,null,null,null,null,null,null,null,null,null,null,null,null,null,null,null,null,null,null,null,null,null,"Group:","Pulp, paper, and allied products"]
[null,null,null,null,null,null,null,null,null,null,null,null,null,null,null,null,null,null,null,null,null,null,null,null,null,null,null,null,"Item:","Paper boxes and containers"]
[]
[null,"INDEX SOURCE"]
[null,"https://fred.stlouisfed.org/series/WPU09"]
[]
[null,"Index is found in TABLE 5, middle of page 1"]
{"$rows_left_out":22}
{"sheet":"PPI - Other controllable","index":9,"n_rows":35,"n_cols":48,"rows_kept":35,"cut":false,"hidden":true,"merged":[[5,1,9,22],[21,19,21,32],[21,34,21,46],[17,41,19,46],[21,47,21,60]]}
[null,null,null,null,null,null,null,null,null,null,null,null,null,null,null,null,null,null,null,null,null,null,null,null,null,null,null,null,"Series Id:","WPUSOP3400"]
[null,null,null,null,null,null,null,null,null,null,null,null,null,null,null,null,null,null,null,null,null,null,null,null,null,null,null,null,"Not Seasonally Adjusted"]
[null,null,null,null,null,null,null,null,null,null,null,null,null,null,null,null,null,null,null,null,null,null,null,null,null,null,null,null,"Group:","Stage of processing"]
[null,null,null,null,null,null,null,null,null,null,null,null,null,null,null,null,null,null,null,null,null,null,null,null,null,null,null,null,"Item:","Finished goods, excluding foods"]
[]
[null,{"$f":"+AP18","v":"The numbers are first published as Preliminary, and each month is updated in the publication 4 months later."}]
[]
[]
[]
[]
{"$rows_left_out":26}
{"sheet":"Hrly Labor Comp. Index","index":10,"n_rows":19,"n_cols":43,"rows_kept":19,"cut":false,"hidden":true,"merged":[[13,16,13,28],[13,30,13,42],[0,1,0,15]]}
[null,"Table 1. SEASONALLY ADJUSTED: Employment Cost Index for total compensation, by ownership, occupational group, and industry"]
[]
[null,"ECI - Accommodation and food services"]
[null,"https://www.bls.gov/news.release/pdf/eci.pdf"]
[]
[null,"Index is found toward the bottom of the sheet - listed under \"Leisure and hospitality\". (pg12)"]
[null,"Note: this index is issued quarterly."]
[null,null,null,null,null,null,null,null,null,null,"September 2020 release set for 10/31/21 at 8:30am"]
[]
[null,"BLS Various Archive News Releases"]
{"$rows_left_out":10}
{"sheet":"Sodexo Comp Guidelines","index":11,"n_rows":9,"n_cols":4,"rows_kept":9,"cut":false,"hidden":true,"merged":[]}
["Budget Guidelines"]
["Executive Summary"]
["Plan Years 2022"]
[]
[]
[]
[]
[null,null,"Medical Increase","Admin Merit Increase"]
[null,"FY22",0.06,0.02]

{"sheet":"Index Chart Data","index":12,"n_rows":49,"n_cols":10,"rows_kept":49,"cut":false,"hidden":true,"merged":[]}
[]
[]
[]
[]
[]
[]
[]
[]
[]
[]
{"$rows_left_out":40}
{"sheet":"Sheet1","index":13,"n_rows":1,"n_cols":1,"rows_kept":1,"cut":false,"hidden":true,"merged":[]}
["Indexes for Use:"]

{"sheet":"Sheet2","index":14,"n_rows":6,"n_cols":2,"rows_kept":6,"cut":false,"hidden":true,"merged":[]}
[null,"Document Type"]
[null,"US Dollars"]
[null,"Division Total"]
[null,"FY 2016 Actual"]
[null,"Pd 01 YTD"]
[null,"OTHER SUBCONTRACTING COSTS : SUB0015_7110"]